Apr 11 00:57:44.302 INFO testing ostn02_phf-0.1.13 against 1.25.0 for beta-1.26.0-beta.2
Apr 11 00:57:44.302 INFO running: cargo +1.25.0 build --frozen
Apr 11 00:57:44.302 INFO creating container for: cargo +1.25.0 build --frozen
Apr 11 00:57:44.302 INFO running `"docker" "create" "-v" "/home/ec2-user/crater/./work/local/test-source/main/beta-1.26.0-beta.2/1.25.0:/source:ro,Z" "-v" "/home/ec2-user/crater/./work/local/target-dirs/beta-1.26.0-beta.2/1.25.0:/target:rw,Z" "-v" "/home/ec2-user/crater/./work/local/cargo-home:/cargo-home:ro,Z" "-v" "/home/ec2-user/crater/./work/local/rustup-home:/rustup-home:ro,Z" "-e" "USER_ID=500" "-e" "CMD=cargo +1.25.0 build --frozen" "-e" "CARGO_INCREMENTAL=0" "-e" "RUST_BACKTRACE=full" "-e" "RUSTFLAGS=--cap-lints=warn" "crater"`
Apr 11 00:57:44.378 INFO blam! 4374d1d8c39fb3c877f5edcbf1c298cab9abdebbac7bd554d2de1115c29a9832
Apr 11 00:57:44.378 INFO running `"docker" "start" "-a" "4374d1d8c39fb3c877f5edcbf1c298cab9abdebbac7bd554d2de1115c29a9832"`
Apr 11 00:57:45.062 INFO kablam!    Compiling ostn02_phf v0.1.13 (file:///source)
Apr 11 00:59:08.143 INFO kablam!     Finished dev [unoptimized + debuginfo] target(s) in 83.8 secs
Apr 11 00:59:08.147 INFO kablam! su: No module specific data is present
Apr 11 00:59:08.520 INFO running `"docker" "rm" "-f" "4374d1d8c39fb3c877f5edcbf1c298cab9abdebbac7bd554d2de1115c29a9832"`
Apr 11 00:59:08.539 INFO blam! 4374d1d8c39fb3c877f5edcbf1c298cab9abdebbac7bd554d2de1115c29a9832
Apr 11 00:59:08.540 INFO running: cargo +1.25.0 test --frozen --no-run
Apr 11 00:59:08.540 INFO creating container for: cargo +1.25.0 test --frozen --no-run
Apr 11 00:59:08.540 INFO running `"docker" "create" "-v" "/home/ec2-user/crater/./work/local/test-source/main/beta-1.26.0-beta.2/1.25.0:/source:ro,Z" "-v" "/home/ec2-user/crater/./work/local/target-dirs/beta-1.26.0-beta.2/1.25.0:/target:rw,Z" "-v" "/home/ec2-user/crater/./work/local/cargo-home:/cargo-home:ro,Z" "-v" "/home/ec2-user/crater/./work/local/rustup-home:/rustup-home:ro,Z" "-e" "USER_ID=500" "-e" "CMD=cargo +1.25.0 test --frozen --no-run" "-e" "CARGO_INCREMENTAL=0" "-e" "RUST_BACKTRACE=full" "-e" "RUSTFLAGS=--cap-lints=warn" "crater"`
Apr 11 00:59:08.625 INFO blam! 33beac66c399f496ff3c4f61e38e9cd5fb97c22ac67819d8c20262ffb0e26a33
Apr 11 00:59:08.626 INFO running `"docker" "start" "-a" "33beac66c399f496ff3c4f61e38e9cd5fb97c22ac67819d8c20262ffb0e26a33"`
Apr 11 00:59:09.310 INFO kablam!    Compiling ostn02_phf v0.1.13 (file:///source)
Apr 11 01:00:28.068 INFO kablam!     Finished dev [unoptimized + debuginfo] target(s) in 78.75 secs
Apr 11 01:00:28.072 INFO kablam! su: No module specific data is present
Apr 11 01:00:28.384 INFO running `"docker" "rm" "-f" "33beac66c399f496ff3c4f61e38e9cd5fb97c22ac67819d8c20262ffb0e26a33"`
Apr 11 01:00:28.403 INFO blam! 33beac66c399f496ff3c4f61e38e9cd5fb97c22ac67819d8c20262ffb0e26a33
Apr 11 01:00:28.404 INFO running: cargo +1.25.0 test --frozen
Apr 11 01:00:28.404 INFO creating container for: cargo +1.25.0 test --frozen
Apr 11 01:00:28.404 INFO running `"docker" "create" "-v" "/home/ec2-user/crater/./work/local/test-source/main/beta-1.26.0-beta.2/1.25.0:/source:ro,Z" "-v" "/home/ec2-user/crater/./work/local/target-dirs/beta-1.26.0-beta.2/1.25.0:/target:rw,Z" "-v" "/home/ec2-user/crater/./work/local/cargo-home:/cargo-home:ro,Z" "-v" "/home/ec2-user/crater/./work/local/rustup-home:/rustup-home:ro,Z" "-e" "USER_ID=500" "-e" "CMD=cargo +1.25.0 test --frozen" "-e" "CARGO_INCREMENTAL=0" "-e" "RUST_BACKTRACE=full" "-e" "RUSTFLAGS=--cap-lints=warn" "crater"`
Apr 11 01:00:28.485 INFO blam! 515a5a04ea8fc1c98f6a8871b9b978c22812afdf666efb588f47a593d4a74de9
Apr 11 01:00:28.486 INFO running `"docker" "start" "-a" "515a5a04ea8fc1c98f6a8871b9b978c22812afdf666efb588f47a593d4a74de9"`
Apr 11 01:00:29.122 INFO kablam!     Finished dev [unoptimized + debuginfo] target(s) in 0.0 secs
Apr 11 01:00:29.124 INFO kablam!      Running /target/debug/deps/ostn02_phf-89aec4efbf44ce08
Apr 11 01:00:29.131 INFO blam! 
Apr 11 01:00:29.131 INFO blam! running 2 tests
Apr 11 01:00:29.502 INFO blam! test test_ffi ... FAILED
Apr 11 01:00:29.503 INFO blam! test test_internal_ffi ... FAILED
Apr 11 01:00:29.503 INFO blam! 
Apr 11 01:00:29.503 INFO blam! failures:
Apr 11 01:00:29.503 INFO blam! 
Apr 11 01:00:29.503 INFO blam! ---- test_ffi stdout ----
Apr 11 01:00:29.503 INFO blam! 	thread 'test_ffi' panicked at 'assertion failed: `(left == right)`
Apr 11 01:00:29.503 INFO blam!   left: `(102.775, -78.244, 44.252)`,
Apr 11 01:00:29.503 INFO blam!  right: `(NaN, NaN, NaN)`', src/lib.rs:162:5
Apr 11 01:00:29.503 INFO blam! stack backtrace:
Apr 11 01:00:29.503 INFO blam!    0:     0x55b68d722603 - std::sys::unix::backtrace::tracing::imp::unwind_backtrace::h09c1ee131a74b1c4
Apr 11 01:00:29.503 INFO blam!                                at libstd/sys/unix/backtrace/tracing/gcc_s.rs:49
Apr 11 01:00:29.503 INFO blam!    1:     0x55b68d71cc44 - std::sys_common::backtrace::_print::h47a337b62b6d5e9e
Apr 11 01:00:29.503 INFO blam!                                at libstd/sys_common/backtrace.rs:71
Apr 11 01:00:29.503 INFO blam!    2:     0x55b68d72160d - std::panicking::default_hook::{{closure}}::h945a649c9017832e
Apr 11 01:00:29.503 INFO blam!                                at libstd/sys_common/backtrace.rs:59
Apr 11 01:00:29.503 INFO blam!                                at libstd/panicking.rs:380
Apr 11 01:00:29.503 INFO blam!    3:     0x55b68d7212ab - std::panicking::default_hook::hcc534c2d30fbcda3
Apr 11 01:00:29.503 INFO blam!                                at libstd/panicking.rs:390
Apr 11 01:00:29.504 INFO blam!    4:     0x55b68d721a80 - std::panicking::rust_panic_with_hook::h09a7a3a353dc2f38
Apr 11 01:00:29.504 INFO blam!                                at libstd/panicking.rs:576
Apr 11 01:00:29.504 INFO blam!    5:     0x55b68d72193e - std::panicking::begin_panic::h8327f16bde15df70
Apr 11 01:00:29.504 INFO blam!                                at libstd/panicking.rs:537
Apr 11 01:00:29.504 INFO blam!    6:     0x55b68d721839 - std::panicking::begin_panic_fmt::h42ff1d37404632d6
Apr 11 01:00:29.504 INFO blam!                                at libstd/panicking.rs:521
Apr 11 01:00:29.504 INFO blam!    7:     0x55b68d6d7dcb - ostn02_phf::test_ffi::h3850ed1488483a64
Apr 11 01:00:29.504 INFO blam!                                at src/lib.rs:162
Apr 11 01:00:29.504 INFO blam!    8:     0x55b68d6e3161 - <F as alloc::boxed::FnBox<A>>::call_box::h8106479744bcbe3a
Apr 11 01:00:29.504 INFO blam!                                at libtest/lib.rs:1462
Apr 11 01:00:29.504 INFO blam!                                at /checkout/src/libcore/ops/function.rs:223
Apr 11 01:00:29.504 INFO blam!                                at /checkout/src/liballoc/boxed.rs:788
Apr 11 01:00:29.504 INFO blam!    9:     0x55b68d72c06e - __rust_maybe_catch_panic
Apr 11 01:00:29.504 INFO blam!                                at libpanic_unwind/lib.rs:102
Apr 11 01:00:29.504 INFO blam!   10:     0x55b68d6dab03 - std::sys_common::backtrace::__rust_begin_short_backtrace::hbe6e8f3a8f0dc6f8
Apr 11 01:00:29.504 INFO blam!                                at /checkout/src/libstd/panicking.rs:458
Apr 11 01:00:29.504 INFO blam!                                at /checkout/src/libstd/panic.rs:358
Apr 11 01:00:29.504 INFO blam!                                at libtest/lib.rs:1414
Apr 11 01:00:29.504 INFO blam!                                at /checkout/src/libstd/sys_common/backtrace.rs:136
Apr 11 01:00:29.504 INFO blam!   11:     0x55b68d6dbc02 - std::panicking::try::do_call::he62ddbc80b0afa86
Apr 11 01:00:29.504 INFO blam!                                at /checkout/src/libstd/thread/mod.rs:406
Apr 11 01:00:29.505 INFO blam!                                at /checkout/src/libstd/panic.rs:293
Apr 11 01:00:29.505 INFO blam!                                at /checkout/src/libstd/panicking.rs:479
Apr 11 01:00:29.505 INFO blam!   12:     0x55b68d72c06e - __rust_maybe_catch_panic
Apr 11 01:00:29.505 INFO blam!                                at libpanic_unwind/lib.rs:102
Apr 11 01:00:29.505 INFO blam!   13:     0x55b68d6e2ef2 - <F as alloc::boxed::FnBox<A>>::call_box::h4290b0f48d980187
Apr 11 01:00:29.505 INFO blam!                                at /checkout/src/libstd/panicking.rs:458
Apr 11 01:00:29.505 INFO blam!                                at /checkout/src/libstd/panic.rs:358
Apr 11 01:00:29.505 INFO blam!                                at /checkout/src/libstd/thread/mod.rs:405
Apr 11 01:00:29.505 INFO blam!                                at /checkout/src/liballoc/boxed.rs:788
Apr 11 01:00:29.505 INFO blam!   14:     0x55b68d723fcb - std::sys::unix::thread::Thread::new::thread_start::h711c51a13a158afa
Apr 11 01:00:29.505 INFO blam!                                at /checkout/src/liballoc/boxed.rs:798
Apr 11 01:00:29.505 INFO blam!                                at libstd/sys_common/thread.rs:24
Apr 11 01:00:29.505 INFO kablam! error: test failed, to rerun pass '--lib'
Apr 11 01:00:29.505 INFO blam!                                at libstd/sys/unix/thread.rs:90
Apr 11 01:00:29.505 INFO blam!   15:     0x7fe14ed4b6b9 - start_thread
Apr 11 01:00:29.505 INFO blam!   16:     0x7fe14e86b41c - clone
Apr 11 01:00:29.505 INFO blam!   17:                0x0 - <unknown>
Apr 11 01:00:29.505 INFO blam! 
Apr 11 01:00:29.505 INFO blam! ---- test_internal_ffi stdout ----
Apr 11 01:00:29.505 INFO blam! 	thread 'test_internal_ffi' panicked at 'assertion failed: `(left == right)`
Apr 11 01:00:29.505 INFO blam!   left: `(102.775, -78.244, 44.252)`,
Apr 11 01:00:29.505 INFO blam!  right: `(NaN, NaN, NaN)`', src/lib.rs:156:5
Apr 11 01:00:29.505 INFO blam! stack backtrace:
Apr 11 01:00:29.505 INFO blam!    0:     0x55b68d722603 - std::sys::unix::backtrace::tracing::imp::unwind_backtrace::h09c1ee131a74b1c4
Apr 11 01:00:29.505 INFO blam!                                at libstd/sys/unix/backtrace/tracing/gcc_s.rs:49
Apr 11 01:00:29.506 INFO blam!    1:     0x55b68d71cc44 - std::sys_common::backtrace::_print::h47a337b62b6d5e9e
Apr 11 01:00:29.506 INFO blam!                                at libstd/sys_common/backtrace.rs:71
Apr 11 01:00:29.506 INFO blam!    2:     0x55b68d72160d - std::panicking::default_hook::{{closure}}::h945a649c9017832e
Apr 11 01:00:29.506 INFO blam!                                at libstd/sys_common/backtrace.rs:59
Apr 11 01:00:29.506 INFO blam!                                at libstd/panicking.rs:380
Apr 11 01:00:29.506 INFO blam!    3:     0x55b68d7212ab - std::panicking::default_hook::hcc534c2d30fbcda3
Apr 11 01:00:29.506 INFO blam!                                at libstd/panicking.rs:390
Apr 11 01:00:29.506 INFO blam!    4:     0x55b68d721a80 - std::panicking::rust_panic_with_hook::h09a7a3a353dc2f38
Apr 11 01:00:29.506 INFO blam!                                at libstd/panicking.rs:576
Apr 11 01:00:29.506 INFO blam!    5:     0x55b68d72193e - std::panicking::begin_panic::h8327f16bde15df70
Apr 11 01:00:29.506 INFO blam!                                at libstd/panicking.rs:537
Apr 11 01:00:29.506 INFO blam!    6:     0x55b68d721839 - std::panicking::begin_panic_fmt::h42ff1d37404632d6
Apr 11 01:00:29.506 INFO blam!                                at libstd/panicking.rs:521
Apr 11 01:00:29.506 INFO blam!    7:     0x55b68d6d7c08 - ostn02_phf::test_internal_ffi::hf1d37716c9db13aa
Apr 11 01:00:29.506 INFO blam!                                at src/lib.rs:156
Apr 11 01:00:29.506 INFO blam!    8:     0x55b68d6e3161 - <F as alloc::boxed::FnBox<A>>::call_box::h8106479744bcbe3a
Apr 11 01:00:29.506 INFO blam!                                at libtest/lib.rs:1462
Apr 11 01:00:29.506 INFO blam!                                at /checkout/src/libcore/ops/function.rs:223
Apr 11 01:00:29.506 INFO blam!                                at /checkout/src/liballoc/boxed.rs:788
Apr 11 01:00:29.506 INFO blam!    9:     0x55b68d72c06e - __rust_maybe_catch_panic
Apr 11 01:00:29.506 INFO blam!                                at libpanic_unwind/lib.rs:102
Apr 11 01:00:29.506 INFO blam!   10:     0x55b68d6dab03 - std::sys_common::backtrace::__rust_begin_short_backtrace::hbe6e8f3a8f0dc6f8
Apr 11 01:00:29.506 INFO blam!                                at /checkout/src/libstd/panicking.rs:458
Apr 11 01:00:29.506 INFO blam!                                at /checkout/src/libstd/panic.rs:358
Apr 11 01:00:29.506 INFO blam!                                at libtest/lib.rs:1414
Apr 11 01:00:29.506 INFO blam!                                at /checkout/src/libstd/sys_common/backtrace.rs:136
Apr 11 01:00:29.506 INFO blam!   11:     0x55b68d6dbc02 - std::panicking::try::do_call::he62ddbc80b0afa86
Apr 11 01:00:29.507 INFO blam!                                at /checkout/src/libstd/thread/mod.rs:406
Apr 11 01:00:29.507 INFO blam!                                at /checkout/src/libstd/panic.rs:293
Apr 11 01:00:29.507 INFO blam!                                at /checkout/src/libstd/panicking.rs:479
Apr 11 01:00:29.507 INFO blam!   12:     0x55b68d72c06e - __rust_maybe_catch_panic
Apr 11 01:00:29.507 INFO blam!                                at libpanic_unwind/lib.rs:102
Apr 11 01:00:29.507 INFO blam!   13:     0x55b68d6e2ef2 - <F as alloc::boxed::FnBox<A>>::call_box::h4290b0f48d980187
Apr 11 01:00:29.507 INFO blam!                                at /checkout/src/libstd/panicking.rs:458
Apr 11 01:00:29.507 INFO blam!                                at /checkout/src/libstd/panic.rs:358
Apr 11 01:00:29.507 INFO blam!                                at /checkout/src/libstd/thread/mod.rs:405
Apr 11 01:00:29.507 INFO blam!                                at /checkout/src/liballoc/boxed.rs:788
Apr 11 01:00:29.507 INFO blam!   14:     0x55b68d723fcb - std::sys::unix::thread::Thread::new::thread_start::h711c51a13a158afa
Apr 11 01:00:29.507 INFO blam!                                at /checkout/src/liballoc/boxed.rs:798
Apr 11 01:00:29.507 INFO blam!                                at libstd/sys_common/thread.rs:24
Apr 11 01:00:29.507 INFO blam!                                at libstd/sys/unix/thread.rs:90
Apr 11 01:00:29.507 INFO blam!   15:     0x7fe14ed4b6b9 - start_thread
Apr 11 01:00:29.507 INFO blam!   16:     0x7fe14e86b41c - clone
Apr 11 01:00:29.507 INFO blam!   17:                0x0 - <unknown>
Apr 11 01:00:29.507 INFO blam! 
Apr 11 01:00:29.507 INFO blam! 
Apr 11 01:00:29.507 INFO blam! failures:
Apr 11 01:00:29.507 INFO blam!     test_ffi
Apr 11 01:00:29.507 INFO blam!     test_internal_ffi
Apr 11 01:00:29.507 INFO kablam! su: No module specific data is present
Apr 11 01:00:29.507 INFO blam! 
Apr 11 01:00:29.507 INFO blam! test result: FAILED. 0 passed; 2 failed; 0 ignored; 0 measured; 0 filtered out
Apr 11 01:00:29.507 INFO blam! 
Apr 11 01:00:29.840 INFO running `"docker" "rm" "-f" "515a5a04ea8fc1c98f6a8871b9b978c22812afdf666efb588f47a593d4a74de9"`
Apr 11 01:00:29.858 INFO blam! 515a5a04ea8fc1c98f6a8871b9b978c22812afdf666efb588f47a593d4a74de9